{"text_format":"1","workbook":"xlsx","n_sheets":2,"sheets":["Calculator","Table"],"not_rendered":{"charts":0,"images":0,"macros":1,"external_links":0,"defined_names":1,"comments":1,"pivot_tables":0},"unopened":[],"bounds":{"document_bytes":16777216,"sheet_cells":100000,"rows_first":2000,"rows_last":500,"rows_between":2000,"halvings":0,"cell_chars":16384,"cell_head_chars":4096},"cells_cut":0,"cells_raw":0,"read":"whole","date_system":"1900"}

{"sheet":"Calculator","index":0,"n_rows":14,"n_cols":14,"rows_kept":14,"cut":false,"hidden":false,"merged":[[12,2,12,13],[1,2,1,13]]}
[]
[null,null,"Refrigerant Charge Converter"]
[]
[]
[]
[]
[null,null,null,null,5,null,40,null,50,null,500,null,1000]
[]
[null,null,"R422D",null,{"$f":"E7*1000/INDEX(Table!$C$6:$C$23,MATCH($C$9,Table!$B$6:$B$23,0))","v":1.8321152209934024},null,{"$f":"G7*1000/INDEX(Table!$C$6:$C$23,MATCH($C$9,Table!$B$6:$B$23,0))","v":14.656921767947219},null,{"$f":"I7*1000/INDEX(Table!$C$6:$C$23,MATCH($C$9,Table!$B$6:$B$23,0))","v":18.321152209934024},null,{"$f":"K7*1000/INDEX(Table!$C$6:$C$23,MATCH($C$9,Table!$B$6:$B$23,0))","v":183.21152209934024},null,{"$f":"M7*1000/INDEX(Table!$C$6:$C$23,MATCH($C$9,Table!$B$6:$B$23,0))","v":366.42304419868049}]
[]
[]
[]
[null,null,"The values above show kilogrammes of refrigerant charge for various threshold levels (expressed in tonnes of CO2 equivalent) in the EU F-Gas Regulation."]
[null,null,"Prepared for the European Commission by SKM Enviros.",null,null,null,null,null,null,null,null,null,null,"March 2013"]

{"sheet":"Table","index":1,"n_rows":20,"n_cols":8,"rows_kept":20,"cut":false,"hidden":false,"merged":[[4,3,4,7],[1,3,1,7]]}
[]
[null,null,null,"Allowable Charge (tCO2e)"]
[null,null,null,5,40,50,500,1000]
[]
[null,"Refrigerant","GWP","Allowable Charge (kg)"]
[null,"R134a",1430,{"$f":"D$3*1000/$C6","v":3.4965034965034967},27.972027972027973,34.965034965034967,349.65034965034965,699.30069930069931]
[null,"R32",675,7.4074074074074074,59.25925925925926,74.074074074074076,740.74074074074076,1481.4814814814815]
[null,"R404A",3921.6000000000004,1.2749898000815991,10.199918400652793,12.749898000815993,127.49898000815992,254.99796001631984]
[null,"R407A",2107,2.3730422401518747,18.984337921214998,23.730422401518748,237.30422401518746,474.60844803037492]
[null,"R407C",1773.85,2.8187276263494661,22.549821010795728,28.18727626349466,281.87276263494658,563.74552526989316]
[null,"R407F",1824.5,2.740476842970677,21.923814743765416,27.40476842970677,274.04768429706769,548.09536859413538]
[null,"R410A",2087.5,2.3952095808383231,19.161676646706585,23.952095808383234,239.52095808383234,479.04191616766468]
[null,"R413A",2053.2199999999998,2.435199345418416,19.481594763347328,24.351993454184161,243.51993454184162,487.03986908368324]
[null,"R417A",2346,2.1312872975277068,17.050298380221655,21.312872975277067,213.12872975277068,426.25745950554136]
[null,"R422A",3143.0859999999998,1.5907932522368144,12.726346017894516,15.907932522368146,159.07932522368145,318.1586504473629]
[null,"R422D",2729.0859999999998,1.8321152209934024,14.656921767947219,18.321152209934024,183.21152209934024,366.42304419868049]
[null,"R427A",2138.25,2.3383608090728401,18.70688647258272,23.383608090728398,233.83608090728399,467.67216181456797]
[null,"R434A",3246,1.5403573629081948,12.322858903265558,15.403573629081947,154.03573629081947,308.07147258163894]
[null,"R507",3985,1.2547051442910917,10.037641154328734,12.547051442910917,125.47051442910916,250.94102885821832]
[null,"R508",13214,0.37838655970939911,3.0270924776751928,3.7838655970939912,37.838655970939911,75.677311941879822]